French (Supreme) Court of Appeal Ontology
type: Ontology
created: 2024-12-18
version info: 3.0
description: An ontology for Criminal Cases at French (Supreme) Court of Appeal
license: https://creativecommons.org/licenses/by/4.0/

Conviction
type: Class
comment: Legal decision regarding guilt of an accused individual.

Offence
type: Class
comment: An act or omission which constitutes a criminal wrongdoing.
subclass of: Event

has Offense Type
type: Property
comment: Relates an offense to its offense type.
domain: Offence
range: OffenseType

Fact
type: Class
comment: A fact related to an event or offence in criminal cases.

issues
type: Property
comment: Indicates that an organization issues or triggers an event.
domain: Organization
range: Event

takesPlaceOn
type: Property
comment: Specifies the date on which an event occurs.
domain: Event
range: Date

contains
type: Property
comment: Denotes events or facts involved in a related event.
domain: Event
range: Event

hasConviction
type: Property
domain: Person
range: Conviction
comment: Indicates a person’s conviction.

hasPunishment
type: Property
domain: Conviction
range: Punishment
comment: Indicates a punishment related to a conviction.

isAssociatedWith
type: Property
domain: Conviction
range: Offence
comment: Associates a conviction with an offence.

concerns
type: Property
comment: Describes the involvement of an event in another event or issue.
domain: Event
range: Event

hasFact
type: Property
comment: Indicates a fact associated with an event.
domain: Event
range: Fact

prosecutes
type: Property
comment: Indicates that a person is prosecuting an event.
domain: Person
range: Event

initiates
type: Property
comment: Describes the initiation of an event by a person.
domain: Person
range: Event

residesAt
type: Property
domain: Person
range: Place
comment: Indicates the residence of a person.

hasProfession
type: Property
domain: Person
range: Occupation
comment: Indicates the profession of a person.

hasMaritalStatus
type: Property
domain: Person
range: Marital Status
comment: Indicates the marital status of a person.

Marital Status
type: Class
comment: Marital status of a person, e.g., single, married, divorced, pacs, widowed.
one of: Single
one of: Married
one of: Divorced
one of: PACS
one of: Widowed

Single
type: Marital Status
comment: Person is not married or in a legal partnership.

Married
type: Marital Status
comment: Person is legally married.

Divorced
type: Marital Status
comment: Person is legally divorced.

PACS
type: Marital Status
comment: Person is in a French civil partnership (PACS).

Widowed
type: Marital Status
comment: Person's spouse has passed away.

knows
type: Property
domain: Person
range: Person
comment: Indicates acquaintance or relation between two persons.

age
type: Property
domain: Person
range: nonNegativeInteger
comment: The age of a person in years. Must be a non-negative integer.
unit code: ANN